Reaction Details
TargetPeroxisome proliferator-activated receptor alpha
LigandBDBM28701
Substrate/Competitorn/a
Meas. Tech.ChEMBL_153392 (CHEMBL763845)
EC50>78000±n/a nM
Citation Nomura, MTanase, TIde, TTsunoda, MSuzuki, MUchiki, HMurakami, KMiyachi, H Design, synthesis, and evaluation of substituted phenylpropanoic acid derivatives as human peroxisome proliferator activated receptor activators. Discovery of potent and human peroxisome proliferator activated receptor alpha subtype-selective activators. J Med Chem46:3581-99 (2003) 
 
Peroxisome proliferator-activated receptor alpha
Name:Peroxisome proliferator-activated receptor alpha
Type:Enzyme
Mol. Mass.:52222.08
Organism:Homo sapiens (Human)
Description:Q07869
Residue:468
BDBM28701
NameBDBM28701
Synonyms:2-(4-{2-[(4-chlorophenyl)formamido]ethyl}phenoxy)-2-methylpropanoic acid Bezafibrate Cedur | Sklerofibrat
TypeSmall organic molecule
Emp. Form.C19H20ClNO4
Mol. Mass.361.819
SMILESCC(C)(Oc1ccc(CCNC(=O)c2ccc(Cl)cc2)cc1)C(O)=O