Reaction Details
TargetAlkaline phosphatase, germ cell type
LigandBDBM50131867
Substrate/Competitorn/a
Meas. Tech.ChEMBL_157081 (CHEMBL765525)
Ki 1500000±n/a nM
Citation Swierczek, KPandey, ASPeters, JWHengge, AC A comparison of phosphonothioic acids with phosphonic acids as phosphatase inhibitors. J Med Chem46:3703-8 (2003) 
 
Alkaline phosphatase, germ cell type
Name:Alkaline phosphatase, germ cell type
Type:PROTEIN
Mol. Mass.:57374.31
Organism:Homo sapiens (Human)
Description:ChEMBL_29964
Residue:532
BDBM50131867
NameBDBM50131867
Synonyms:6-Thiophosphono-hexanoic acid | CHEMBL123990
TypeSmall organic molecule
Emp. Form.C6H13O4PS
Mol. Mass.212.204
SMILESOC(=O)CCCCCP(O)(O)=S