Reaction Details
TargetAlkaline phosphatase, germ cell type
LigandBDBM50131871
Substrate/Competitorn/a
Meas. Tech.ChEMBL_157081 (CHEMBL765525)
Ki 40000±n/a nM
Citation Swierczek, KPandey, ASPeters, JWHengge, AC A comparison of phosphonothioic acids with phosphonic acids as phosphatase inhibitors. J Med Chem46:3703-8 (2003) 
 
Alkaline phosphatase, germ cell type
Name:Alkaline phosphatase, germ cell type
Type:PROTEIN
Mol. Mass.:57374.31
Organism:Homo sapiens (Human)
Description:ChEMBL_29964
Residue:532
BDBM50131871
NameBDBM50131871
Synonyms:CHEMBL122097 | Methylsulfanylmethyl-phosphonothioic acid
TypeSmall organic molecule
Emp. Form.C2H7O2PS2
Mol. Mass.158.18
SMILESCSCP(O)(O)=S