Reaction Details
TargetProtein tyrosine phosphatase receptor type C-associated protein
LigandBDBM50131866
Substrate/Competitorn/a
Meas. Tech.ChEMBL_210866 (CHEMBL812679)
Ki 200000±n/a nM
Citation Swierczek, KPandey, ASPeters, JWHengge, AC A comparison of phosphonothioic acids with phosphonic acids as phosphatase inhibitors. J Med Chem46:3703-8 (2003) 
 
Protein tyrosine phosphatase receptor type C-associated protein
Name:Protein tyrosine phosphatase receptor type C-associated protein
Type:PROTEIN
Mol. Mass.:21182.08
Organism:Homo sapiens (Human)
Description:ChEMBL_210870
Residue:206
BDBM50131866
NameBDBM50131866
Synonyms:7-Thiophosphonomethyl-naphthalene-1-carboxylic acid | CHEMBL122519
TypeSmall organic molecule
Emp. Form.C12H11O4PS
Mol. Mass.282.252
SMILESOC(=O)c1cccc2ccc(CP(O)(O)=S)cc12