Reaction Details
TargetAlpha-1A adrenergic receptor
LigandBDBM50131891
Substrate/Competitorn/a
Meas. Tech.ChEMBL_33743 (CHEMBL647058)
Ki 0.094±n/a nM
Citation Boschi, DTron, GCDi Stilo, AFruttero, RGasco, APoggesi, EMotta, GLeonardi, A New potential uroselective NO-donor alpha1-antagonists. J Med Chem46:3762-5 (2003) 
 
Alpha-1A adrenergic receptor
Name:Alpha-1A adrenergic receptor
Type:Cell-surface receptors
Mol. Mass.:51511.67
Organism:Homo sapiens (Human)
Description:P35348
Residue:466
BDBM50131891
NameBDBM50131891
Synonyms:3-Methyl-4-oxo-2-phenyl-4H-chromene-8-carboxylic acid (3-{4-[2-(3-nitrooxy-propoxy)-phenyl]-piperazin-1-yl}-propyl)-amide | CHEMBL338029
TypeSmall organic molecule
Emp. Form.C33H36N4O7
Mol. Mass.600.6615
SMILESCc1c(oc2c(cccc2c1=O)C(=O)NCCCN1CCN(CC1)c1ccccc1OCCCO[N+]([O-])=O)-c1ccccc1