Reaction Details
TargetAlpha-1A adrenergic receptor
LigandBDBM50057465
Substrate/Competitorn/a
Meas. Tech.ChEMBL_33743 (CHEMBL647058)
Ki 0.34±n/a nM
Citation Boschi, DTron, GCDi Stilo, AFruttero, RGasco, APoggesi, EMotta, GLeonardi, A New potential uroselective NO-donor alpha1-antagonists. J Med Chem46:3762-5 (2003) 
 
Alpha-1A adrenergic receptor
Name:Alpha-1A adrenergic receptor
Type:Cell-surface receptors
Mol. Mass.:51511.67
Organism:Homo sapiens (Human)
Description:P35348
Residue:466
BDBM50057465
NameBDBM50057465
Synonyms:3-Methyl-4-oxo-2-phenyl-4H-chromene-8-carboxylic acid {3-[4-(2-methoxy-phenyl)-piperazin-1-yl]-propyl}-amide Upidosin
TypeSmall organic molecule
Emp. Form.C31H33N3O4
Mol. Mass.511.6114
SMILESCOc1ccccc1N1CCN(CCCNC(=O)c2cccc3c2oc(c(C)c3=O)-c2ccccc2)CC1