Reaction Details
TargetAlpha-1B adrenergic receptor
LigandBDBM50131890
Substrate/Competitorn/a
Meas. Tech.ChEMBL_34462 (CHEMBL651994)
Ki 6.5±n/a nM
Citation Boschi, DTron, GCDi Stilo, AFruttero, RGasco, APoggesi, EMotta, GLeonardi, A New potential uroselective NO-donor alpha1-antagonists. J Med Chem46:3762-5 (2003) 
 
Alpha-1B adrenergic receptor
Name:Alpha-1B adrenergic receptor
Type:Enzyme
Mol. Mass.:56862.13
Organism:Homo sapiens (Human)
Description:P35368
Residue:520
BDBM50131890
NameBDBM50131890
Synonyms:3-Methyl-4-oxo-2-phenyl-4H-chromene-8-carboxylic acid (3-{4-[2-(4-cyano-5-oxy-furazan-3-ylmethoxy)-phenyl]-piperazin-1-yl}-propyl)-amide | CHEMBL125989
TypeSmall organic molecule
Emp. Form.C34H32N6O6
Mol. Mass.620.6545
SMILESCc1c(oc2c(cccc2c1=O)C(=O)NCCCN1CCN(CC1)c1ccccc1OCc1no[n+]([O-])c1C#N)-c1ccccc1