Reaction Details
Target5-hydroxytryptamine receptor 1A
LigandBDBM50131888
Substrate/Competitorn/a
Meas. Tech.ChEMBL_953 (CHEMBL616132)
Ki 1.2±n/a nM
Citation Boschi, DTron, GCDi Stilo, AFruttero, RGasco, APoggesi, EMotta, GLeonardi, A New potential uroselective NO-donor alpha1-antagonists. J Med Chem46:3762-5 (2003) 
 
5-hydroxytryptamine receptor 1A
Name:5-hydroxytryptamine receptor 1A
Type:n/a
Mol. Mass.:46122.49
Organism:Homo sapiens (Human)
Description:n/a
Residue:422
BDBM50131888
NameBDBM50131888
Synonyms:4-[2-(4-{3-[(3-Methyl-4-oxo-2-phenyl-4H-chromene-8-carbonyl)-amino]-propyl}-piperazin-1-yl)-phenoxymethyl]-2-oxy-furazan-3-carboxylic acid amide | CHEMBL125365
TypeSmall organic molecule
Emp. Form.C34H34N6O7
Mol. Mass.638.6698
SMILESCc1c(oc2c(cccc2c1=O)C(=O)NCCCN1CCN(CC1)c1ccccc1OCc1no[n+]([O-])c1C(N)=O)-c1ccccc1