Reaction Details
TargetD(3) dopamine receptor
LigandBDBM50132012
Substrate/Competitorn/a
Meas. Tech.ChEMBL_62137 (CHEMBL675894)
Ki 0.5±n/a nM
Citation Hackling, AGhosh, RPerachon, SMann, AHöltje, HDWermuth, CGSchwartz, JCSippl, WSokoloff, PStark, H N-(omega-(4-(2-methoxyphenyl)piperazin-1-yl)alkyl)carboxamides as dopamine D2 and D3 receptor ligands. J Med Chem46:3883-99 (2003) 
 
D(3) dopamine receptor
Name:D(3) dopamine receptor
Type:n/a
Mol. Mass.:44243.43
Organism:Homo sapiens (Human)
Description:n/a
Residue:400
BDBM50132012
NameBDBM50132012
Synonyms:(E)-3-(4-Iodo-phenyl)-N-{4-[4-(2-methoxy-phenyl)-piperazin-1-yl]-butyl}-acrylamide CHEMBL340712
TypeSmall organic molecule
Emp. Form.C24H30IN3O2
Mol. Mass.519.4184
SMILESCOc1ccccc1N1CCN(CCCCNC(=O)\C=C\c2ccc(I)cc2)CC1