Reaction Details
TargetD(3) dopamine receptor
LigandBDBM50132049
Substrate/Competitorn/a
Meas. Tech.ChEMBL_62137 (CHEMBL675894)
Ki 9.2±n/a nM
Citation Hackling, AGhosh, RPerachon, SMann, AHöltje, HDWermuth, CGSchwartz, JCSippl, WSokoloff, PStark, H N-(omega-(4-(2-methoxyphenyl)piperazin-1-yl)alkyl)carboxamides as dopamine D2 and D3 receptor ligands. J Med Chem46:3883-99 (2003) 
 
D(3) dopamine receptor
Name:D(3) dopamine receptor
Type:n/a
Mol. Mass.:44243.43
Organism:Homo sapiens (Human)
Description:n/a
Residue:400
BDBM50132049
NameBDBM50132049
Synonyms:3-Iodo-N-{4-[4-(2-methoxy-phenyl)-piperazin-1-yl]-butyl}-benzamide; oxalic acid | CHEMBL126502
TypeSmall organic molecule
Emp. Form.C22H28IN3O2
Mol. Mass.493.3811
SMILESCOc1ccccc1N1CCN(CCCCNC(=O)c2cccc(I)c2)CC1