Reaction Details
TargetD(2) dopamine receptor
LigandBDBM50131934
Substrate/Competitorn/a
Meas. Tech.ChEMBL_60074 (CHEMBL671730)
Ki 53.2±n/a nM
Citation Hackling, AGhosh, RPerachon, SMann, AHöltje, HDWermuth, CGSchwartz, JCSippl, WSokoloff, PStark, H N-(omega-(4-(2-methoxyphenyl)piperazin-1-yl)alkyl)carboxamides as dopamine D2 and D3 receptor ligands. J Med Chem46:3883-99 (2003) 
 
D(2) dopamine receptor
Name:D(2) dopamine receptor
Type:Cell-surface receptors
Mol. Mass.:50647.10
Organism:Homo sapiens (Human)
Description:P14416
Residue:443
BDBM50131934
NameBDBM50131934
Synonyms:CHEMBL126439 Quinoline-2-carboxylic acid {4-[4-(2-methoxy-phenyl)-piperazin-1-yl]-butyl}-amide
TypeSmall organic molecule
Emp. Form.C25H30N4O2
Mol. Mass.418.5313
SMILESCOc1ccccc1N1CCN(CCCCNC(=O)c2ccc3ccccc3n2)CC1