Reaction Details
TargetD(3) dopamine receptor
LigandBDBM50132068
Substrate/Competitorn/a
Meas. Tech.ChEMBL_62137 (CHEMBL675894)
Ki 7.99±n/a nM
Citation Hackling, AGhosh, RPerachon, SMann, AHöltje, HDWermuth, CGSchwartz, JCSippl, WSokoloff, PStark, H N-(omega-(4-(2-methoxyphenyl)piperazin-1-yl)alkyl)carboxamides as dopamine D2 and D3 receptor ligands. J Med Chem46:3883-99 (2003) 
 
D(3) dopamine receptor
Name:D(3) dopamine receptor
Type:n/a
Mol. Mass.:44243.43
Organism:Homo sapiens (Human)
Description:n/a
Residue:400
BDBM50132068
NameBDBM50132068
Synonyms:4-tert-Butyl-N-{4-[4-(2-methoxy-phenyl)-piperazin-1-yl]-butyl}-benzamide | CHEMBL127288
TypeSmall organic molecule
Emp. Form.C26H37N3O2
Mol. Mass.423.5909
SMILESCOc1ccccc1N1CCN(CCCCNC(=O)c2ccc(cc2)C(C)(C)C)CC1