Reaction Details
TargetD(3) dopamine receptor
LigandBDBM50132067
Substrate/Competitorn/a
Meas. Tech.ChEMBL_62137 (CHEMBL675894)
Ki 0.74±n/a nM
Citation Hackling, AGhosh, RPerachon, SMann, AHöltje, HDWermuth, CGSchwartz, JCSippl, WSokoloff, PStark, H N-(omega-(4-(2-methoxyphenyl)piperazin-1-yl)alkyl)carboxamides as dopamine D2 and D3 receptor ligands. J Med Chem46:3883-99 (2003) 
 
D(3) dopamine receptor
Name:D(3) dopamine receptor
Type:n/a
Mol. Mass.:44243.43
Organism:Homo sapiens (Human)
Description:n/a
Residue:400
BDBM50132067
NameBDBM50132067
Synonyms:CHEMBL129465 | N-{4-[4-(2-Methoxy-phenyl)-piperazin-1-yl]-butyl}-3-(4-nitro-phenyl)-acrylamideoxalic acid;
TypeSmall organic molecule
Emp. Form.C24H30N4O4
Mol. Mass.438.5194
SMILESCOc1ccccc1N1CCN(CCCCNC(=O)\C=C\c2ccc(cc2)[N+]([O-])=O)CC1