Reaction Details
TargetD(2) dopamine receptor
LigandBDBM50132044
Substrate/Competitorn/a
Meas. Tech.ChEMBL_60074 (CHEMBL671730)
Ki 18±n/a nM
Citation Hackling, AGhosh, RPerachon, SMann, AHöltje, HDWermuth, CGSchwartz, JCSippl, WSokoloff, PStark, H N-(omega-(4-(2-methoxyphenyl)piperazin-1-yl)alkyl)carboxamides as dopamine D2 and D3 receptor ligands. J Med Chem46:3883-99 (2003) 
 
D(2) dopamine receptor
Name:D(2) dopamine receptor
Type:Cell-surface receptors
Mol. Mass.:50647.10
Organism:Homo sapiens (Human)
Description:P14416
Residue:443
BDBM50132044
NameBDBM50132044
Synonyms:9-Oxo-9H-fluorene-4-carboxylic acid {4-[4-(2-methoxy-phenyl)-piperazin-1-yl]-butyl}-amide | CHEMBL126834
TypeSmall organic molecule
Emp. Form.C29H31N3O3
Mol. Mass.469.5747
SMILESCOc1ccccc1N1CCN(CCCCNC(=O)c2cccc3C(=O)c4ccccc4-c23)CC1