Reaction Details
TargetD(3) dopamine receptor
LigandBDBM50132081
Substrate/Competitorn/a
Meas. Tech.ChEMBL_62137 (CHEMBL675894)
Ki 1.28±n/a nM
Citation Hackling, AGhosh, RPerachon, SMann, AHöltje, HDWermuth, CGSchwartz, JCSippl, WSokoloff, PStark, H N-(omega-(4-(2-methoxyphenyl)piperazin-1-yl)alkyl)carboxamides as dopamine D2 and D3 receptor ligands. J Med Chem46:3883-99 (2003) 
 
D(3) dopamine receptor
Name:D(3) dopamine receptor
Type:n/a
Mol. Mass.:44243.43
Organism:Homo sapiens (Human)
Description:n/a
Residue:400
BDBM50132081
NameBDBM50132081
Synonyms:3-(2,4-Dichloro-phenyl)-N-{4-[4-(2-methoxy-phenyl)-piperazin-1-yl]-butyl}-acrylamide; oxalic acid | CHEMBL338063
TypeSmall organic molecule
Emp. Form.C24H29Cl2N3O2
Mol. Mass.462.412
SMILESCOc1ccccc1N1CCN(CCCCNC(=O)\C=C\c2ccc(Cl)cc2Cl)CC1