Reaction Details
Target5-hydroxytryptamine receptor 5A
LigandBDBM50132115
Substrate/Competitorn/a
Meas. Tech.ChEMBL_3595 (CHEMBL618080)
Ki 90±n/a nM
Citation Khorana, NSmith, CHerrick-Davis, KPurohit, ATeitler, MGrella, BDukat, MGlennon, RA Binding of tetrahydrocarboline derivatives at human 5-HT5A receptors. J Med Chem46:3930-7 (2003) 
 
5-hydroxytryptamine receptor 5A
Name:5-hydroxytryptamine receptor 5A
Type:Enzyme Catalytic Domain
Mol. Mass.:40749.33
Organism:MOUSE
Description:5-HT5 0 MOUSE::P30966
Residue:357
BDBM50132115
NameBDBM50132115
Synonyms:2-[4-(4-Methoxy-phenyl)-butyl]-5-methyl-2,3,4,5-tetrahydro-1H-pyrido[4,3-b]indole | CHEMBL128945
TypeSmall organic molecule
Emp. Form.C23H28N2O
Mol. Mass.348.4812
SMILESCOc1ccc(CCCCN2CCc3c(C2)c2ccccc2n3C)cc1