Reaction Details
Target5-hydroxytryptamine receptor 5A
LigandBDBM50132090
Substrate/Competitorn/a
Meas. Tech.ChEMBL_3595 (CHEMBL618080)
Ki 98±n/a nM
Citation Khorana, NSmith, CHerrick-Davis, KPurohit, ATeitler, MGrella, BDukat, MGlennon, RA Binding of tetrahydrocarboline derivatives at human 5-HT5A receptors. J Med Chem46:3930-7 (2003) 
 
5-hydroxytryptamine receptor 5A
Name:5-hydroxytryptamine receptor 5A
Type:Enzyme Catalytic Domain
Mol. Mass.:40749.33
Organism:MOUSE
Description:5-HT5 0 MOUSE::P30966
Residue:357
BDBM50132090
NameBDBM50132090
Synonyms:2-[3-(4-Fluoro-phenoxy)-propyl]-8-methoxy-5-methyl-2,3,4,5-tetrahydro-1H-pyrido[4,3-b]indole | CHEMBL128185
TypeSmall organic molecule
Emp. Form.C22H25FN2O2
Mol. Mass.368.4445
SMILESCOc1ccc2n(C)c3CCN(CCCOc4ccc(F)cc4)Cc3c2c1