Reaction Details
Target5-hydroxytryptamine receptor 5A
LigandBDBM50132087
Substrate/Competitorn/a
Meas. Tech.ChEMBL_3595 (CHEMBL618080)
Ki 25±n/a nM
Citation Khorana, NSmith, CHerrick-Davis, KPurohit, ATeitler, MGrella, BDukat, MGlennon, RA Binding of tetrahydrocarboline derivatives at human 5-HT5A receptors. J Med Chem46:3930-7 (2003) 
 
5-hydroxytryptamine receptor 5A
Name:5-hydroxytryptamine receptor 5A
Type:Enzyme Catalytic Domain
Mol. Mass.:40749.33
Organism:MOUSE
Description:5-HT5 0 MOUSE::P30966
Residue:357
BDBM50132087
NameBDBM50132087
Synonyms:5-Methyl-2-(3-phenoxy-propyl)-2,3,4,5-tetrahydro-1H-pyrido[4,3-b]indole | CHEMBL128848
TypeSmall organic molecule
Emp. Form.C21H24N2O
Mol. Mass.320.4281
SMILESCn1c2CCN(CCCOc3ccccc3)Cc2c2ccccc12