Reaction Details
Target5-hydroxytryptamine receptor 5A
LigandBDBM50132085
Substrate/Competitorn/a
Meas. Tech.ChEMBL_3595 (CHEMBL618080)
Ki 335±n/a nM
Citation Khorana, NSmith, CHerrick-Davis, KPurohit, ATeitler, MGrella, BDukat, MGlennon, RA Binding of tetrahydrocarboline derivatives at human 5-HT5A receptors. J Med Chem46:3930-7 (2003) 
 
5-hydroxytryptamine receptor 5A
Name:5-hydroxytryptamine receptor 5A
Type:Enzyme Catalytic Domain
Mol. Mass.:40749.33
Organism:MOUSE
Description:5-HT5 0 MOUSE::P30966
Residue:357
BDBM50132085
NameBDBM50132085
Synonyms:2-(3-Phenoxy-propyl)-2,3,4,9-tetrahydro-1H-beta-carboline | CHEMBL424258
TypeSmall organic molecule
Emp. Form.C20H22N2O
Mol. Mass.306.4015
SMILESC(COc1ccccc1)CN1CCc2c(C1)[nH]c1ccccc21