Reaction Details
Target5-hydroxytryptamine receptor 2A
LigandBDBM50132095
Substrate/Competitorn/a
Meas. Tech.ChEMBL_2646 (CHEMBL618895)
Ki 65±n/a nM
Citation Khorana, NSmith, CHerrick-Davis, KPurohit, ATeitler, MGrella, BDukat, MGlennon, RA Binding of tetrahydrocarboline derivatives at human 5-HT5A receptors. J Med Chem46:3930-7 (2003) 
 
5-hydroxytryptamine receptor 2A
Name:5-hydroxytryptamine receptor 2A
Type:G Protein-Coupled Receptor (GPCR)
Mol. Mass.:52852.05
Organism:Rattus norvegicus (rat)
Description:Rat cortex membranes 5-HT2A receptors.
Residue:471
BDBM50132095
NameBDBM50132095
Synonyms:5-Benzyl-2-(3-phenoxy-propyl)-2,3,4,5-tetrahydro-1H-pyrido[4,3-b]indole | CHEMBL130586
TypeSmall organic molecule
Emp. Form.C27H28N2O
Mol. Mass.396.524
SMILESC(COc1ccccc1)CN1CCc2c(C1)c1ccccc1n2Cc1ccccc1