Reaction Details
Target5-hydroxytryptamine receptor 5A
LigandBDBM50132114
Substrate/Competitorn/a
Meas. Tech.ChEMBL_3584 (CHEMBL620717)
Ki 174±n/a nM
Citation Khorana, NSmith, CHerrick-Davis, KPurohit, ATeitler, MGrella, BDukat, MGlennon, RA Binding of tetrahydrocarboline derivatives at human 5-HT5A receptors. J Med Chem46:3930-7 (2003) 
 
5-hydroxytryptamine receptor 5A
Name:5-hydroxytryptamine receptor 5A
Type:Enzyme
Mol. Mass.:40266.25
Organism:Homo sapiens (Human)
Description:P47898
Residue:357
BDBM50132114
NameBDBM50132114
Synonyms:5-Methyl-2-(5-phenyl-pentyl)-2,3,4,5-tetrahydro-1H-pyrido[4,3-b]indole | CHEMBL125417
TypeSmall organic molecule
Emp. Form.C23H28N2
Mol. Mass.332.4818
SMILESCn1c2CCN(CCCCCc3ccccc3)Cc2c2ccccc12