Reaction Details
Target5-hydroxytryptamine receptor 5A
LigandBDBM50132084
Substrate/Competitorn/a
Meas. Tech.ChEMBL_3584 (CHEMBL620717)
Ki 1395±n/a nM
Citation Khorana, NSmith, CHerrick-Davis, KPurohit, ATeitler, MGrella, BDukat, MGlennon, RA Binding of tetrahydrocarboline derivatives at human 5-HT5A receptors. J Med Chem46:3930-7 (2003) 
 
5-hydroxytryptamine receptor 5A
Name:5-hydroxytryptamine receptor 5A
Type:Enzyme
Mol. Mass.:40266.25
Organism:Homo sapiens (Human)
Description:P47898
Residue:357
BDBM50132084
NameBDBM50132084
Synonyms:2-[3-(4-Fluoro-phenoxy)-propyl]-6-methoxy-5-methyl-2,3,4,5-tetrahydro-1H-pyrido[4,3-b]indole | CHEMBL128184
TypeSmall organic molecule
Emp. Form.C22H25FN2O2
Mol. Mass.368.4445
SMILESCOc1cccc2c3CN(CCCOc4ccc(F)cc4)CCc3n(C)c12