Reaction Details
Target5-hydroxytryptamine receptor 5A
LigandBDBM50132105
Substrate/Competitorn/a
Meas. Tech.ChEMBL_3584 (CHEMBL620717)
Ki 190±n/a nM
Citation Khorana, NSmith, CHerrick-Davis, KPurohit, ATeitler, MGrella, BDukat, MGlennon, RA Binding of tetrahydrocarboline derivatives at human 5-HT5A receptors. J Med Chem46:3930-7 (2003) 
 
5-hydroxytryptamine receptor 5A
Name:5-hydroxytryptamine receptor 5A
Type:Enzyme
Mol. Mass.:40266.25
Organism:Homo sapiens (Human)
Description:P47898
Residue:357
BDBM50132105
NameBDBM50132105
Synonyms:4-[3-(5-Methyl-1,3,4,5-tetrahydro-pyrido[4,3-b]indol-2-yl)-propoxy]-phenylamine | CHEMBL435814
TypeSmall organic molecule
Emp. Form.C21H25N3O
Mol. Mass.335.4427
SMILESCn1c2CCN(CCCOc3ccc(N)cc3)Cc2c2ccccc12