Reaction Details
TargetProto-oncogene tyrosine-protein kinase Src
LigandBDBM50132160
Substrate/Competitorn/a
Meas. Tech.ChEMBL_202631 (CHEMBL805895)
IC50 3.3±n/a nM
Citation Boschelli, DHPowell, DGolas, JMBoschelli, F Inhibition of Src kinase activity by 4-anilino-5,10-dihydro-pyrimido[4,5-b]quinolines. Bioorg Med Chem Lett13:2977-80 (2003) Proto-oncogene tyrosine-protein kinase Src
Name:Proto-oncogene tyrosine-protein kinase Src
Type:Protein
Mol. Mass.:59838.60
Organism:Homo sapiens (Human)
Description:P12931
Residue:536
BDBM50132160
NameBDBM50132160
Synonyms:(2,4-Dichloro-5-methoxy-phenyl)-(7,8-dimethoxy-4a,5,10,10a-tetrahydro-pyrimido[4,5-b]quinolin-4-yl)-amine | CHEMBL102000
TypeSmall organic molecule
Emp. Form.C20H18Cl2N4O3
Mol. Mass.433.288
SMILESCOc1cc(Nc2ncnc3Nc4cc(OC)c(OC)cc4Cc23)c(Cl)cc1Cl