Reaction Details
TargetPlatelet-derived growth factor receptor beta
LigandBDBM50118831
Substrate/Competitorn/a
Meas. Tech.ChEBML_158518
IC50 550±n/a nM
Citation Matsuno, KSeishi, TNakajima, TIchimura, MGiese, NAYu, JCOda, SNomoto, Y Potent and selective inhibitors of platelet-derived growth factor receptor phosphorylation. Part 4: structure-activity relationships for substituents on the quinazoline moiety of 4-[4-(N-substituted(thio)carbamoyl)-1-piperazinyl]-6,7-dimethoxyquinazoline derivatives. Bioorg Med Chem Lett13:3001-4 (2003) Platelet-derived growth factor receptor beta
Name:Platelet-derived growth factor receptor beta
Type:Enzyme
Mol. Mass.:123922.25
Organism:Homo sapiens (Human)
Description:P09619
Residue:1106
BDBM50118831
NameBDBM50118831
Synonyms:4-(6,7-Dimethoxy-quinazolin-4-yl)-piperazine-1-carbothioic acid benzylamide | CHEMBL319894
TypeSmall organic molecule
Emp. Form.C22H25N5O2S
Mol. Mass.423.531
SMILESCOc1cc2ncnc(N3CCN(CC3)C(=S)NCc3ccccc3)c2cc1OC