Reaction Details
TargetPlatelet-derived growth factor receptor beta
LigandBDBM50132211
Substrate/Competitorn/a
Meas. Tech.ChEBML_158518
IC50 200±n/a nM
Citation Matsuno, KSeishi, TNakajima, TIchimura, MGiese, NAYu, JCOda, SNomoto, Y Potent and selective inhibitors of platelet-derived growth factor receptor phosphorylation. Part 4: structure-activity relationships for substituents on the quinazoline moiety of 4-[4-(N-substituted(thio)carbamoyl)-1-piperazinyl]-6,7-dimethoxyquinazoline derivatives. Bioorg Med Chem Lett13:3001-4 (2003) Platelet-derived growth factor receptor beta
Name:Platelet-derived growth factor receptor beta
Type:Enzyme
Mol. Mass.:123922.25
Organism:Homo sapiens (Human)
Description:P09619
Residue:1106
BDBM50132211
NameBDBM50132211
Synonyms:4-(7-Ethylamino-6-nitro-quinazolin-4-yl)-piperazine-1-carboxylic acid (4-phenoxy-phenyl)-amide | CHEMBL99729
TypeSmall organic molecule
Emp. Form.C27H27N7O4
Mol. Mass.513.5478
SMILESCCNc1cc2ncnc(N3CCN(CC3)C(=O)Nc3ccc(Oc4ccccc4)cc3)c2cc1[N+]([O-])=O