Reaction Details
TargetTyrosine-protein phosphatase non-receptor type 1
LigandBDBM50075312
Substrate/Competitorn/a
Meas. Tech.ChEBML_162275
Ki 179000±n/a nM
Citation Liu, DGGao, YVoigt, JHLee, KNicklaus, MCWu, LZhang, ZYBurke, TR Acylsulfonamide-containing PTP1B inhibitors designed to mimic an enzyme-bound water of hydration. Bioorg Med Chem Lett13:3005-7 (2003) Tyrosine-protein phosphatase non-receptor type 1
Name:Tyrosine-protein phosphatase non-receptor type 1
Type:Protein phosphatase
Mol. Mass.:49963.76
Organism:Homo sapiens (Human)
Description:Human recombinant GST-fusion PTP1B (1-435).
Residue:435
BDBM50075312
NameBDBM50075312
Synonyms:(Difluoro-naphthalen-2-yl-methyl)-phosphonic acid difluoro(2-naphthyl)methylphosphonate | difluoro(naphthalen-2-yl)methylphosphonate
TypeSmall organic molecule
Emp. Form.C11H9F2O3P
Mol. Mass.258.1579
SMILESOP(O)(=O)C(F)(F)c1ccc2ccccc2c1