Reaction Details
TargetProtein kinase C gamma type
LigandBDBM50132247
Substrate/Competitorn/a
Meas. Tech.ChEMBL_161306 (CHEMBL772114)
Ki 5750±n/a nM
Citation Nakagawa, YIrie, KYamanaka, NOhigashi, HTsuda, K Synthesis and binding selectivity of 7- and 15-decylbenzolactone-V8 for the C1 domains of protein kinase C isozymes. Bioorg Med Chem Lett13:3015-9 (2003) Protein kinase C gamma type
Name:Protein kinase C gamma type
Type:Enzyme
Mol. Mass.:78458.05
Organism:Homo sapiens (Human)
Description:The recombinant human PKC enzymes were produced using a baculovirus expression system in SF9 cells
Residue:697
BDBM50132247
NameBDBM50132247
Synonyms:5-Hydroxymethyl-2-isopropyl-1-undecyl-1,2,5,6-tetrahydro-benzo[e][1,4]oxazocin-3-one | CHEMBL102991
TypeSmall organic molecule
Emp. Form.C25H41NO3
Mol. Mass.403.5979
SMILESCCCCCCCCCCCN1[C@@H](C(C)C)C(=O)O[C@H](CO)Cc2ccccc12