Reaction Details
TargetProtein kinase C delta type
LigandBDBM50132246
Substrate/Competitorn/a
Meas. Tech.ChEBML_160946
Ki>10000±n/a nM
Citation Nakagawa, YIrie, KYamanaka, NOhigashi, HTsuda, K Synthesis and binding selectivity of 7- and 15-decylbenzolactone-V8 for the C1 domains of protein kinase C isozymes. Bioorg Med Chem Lett13:3015-9 (2003) Protein kinase C delta type
Name:Protein kinase C delta type
Type:Enzyme
Mol. Mass.:77516.79
Organism:Homo sapiens (Human)
Description:The recombinant human PKC enzymes were produced using a baculovirus expression system in SF9 cells
Residue:676
BDBM50132246
NameBDBM50132246
Synonyms:7-Decyl-5-hydroxymethyl-2-isopropyl-1-methyl-1,2,5,6-tetrahydro-benzo[e][1,4]oxazocin-3-one | CHEMBL103091
TypeSmall organic molecule
Emp. Form.C25H41NO3
Mol. Mass.403.5979
SMILESCCCCCCCCCCc1cccc2N(C)[C@@H](C(C)C)C(=O)O[C@H](CO)Cc12