Reaction Details
TargetThymidine kinase, cytosolic
LigandBDBM50132253
Substrate/Competitorn/a
Meas. Tech.ChEMBL_210618 (CHEMBL811735)
IC50 2300±n/a nM
Citation Hernández, AIBalzarini, JRodríguez-Barrios, FSan-Félix, AKarlsson, AGago, FCamarasa, MJPérez-Pérez, MJ Improving the selectivity of acyclic nucleoside analogues as inhibitors of human mitochondrial thymidine kinase: replacement of a triphenylmethoxy moiety with substituted amines and carboxamides. Bioorg Med Chem Lett13:3027-30 (2003) Thymidine kinase, cytosolic
Name:Thymidine kinase, cytosolic
Type:PROTEIN
Mol. Mass.:25476.50
Organism:Homo sapiens (Human)
Description:ChEMBL_1333884
Residue:234
BDBM50132253
NameBDBM50132253
Synonyms:5-Methyl-1-[4-(trityl-amino)-but-2-enyl]-1H-pyrimidine-2,4-dione | CHEMBL322230
TypeSmall organic molecule
Emp. Form.C28H27N3O2
Mol. Mass.437.5329
SMILESCc1cn(C\C=C/CNC(c2ccccc2)(c2ccccc2)c2ccccc2)c(=O)[nH]c1=O