Reaction Details
TargetThymidine kinase, cytosolic
LigandBDBM50132252
Substrate/Competitorn/a
Meas. Tech.ChEMBL_210618 (CHEMBL811735)
IC50 4100±n/a nM
Citation Hernández, AIBalzarini, JRodríguez-Barrios, FSan-Félix, AKarlsson, AGago, FCamarasa, MJPérez-Pérez, MJ Improving the selectivity of acyclic nucleoside analogues as inhibitors of human mitochondrial thymidine kinase: replacement of a triphenylmethoxy moiety with substituted amines and carboxamides. Bioorg Med Chem Lett13:3027-30 (2003) Thymidine kinase, cytosolic
Name:Thymidine kinase, cytosolic
Type:PROTEIN
Mol. Mass.:25476.50
Organism:Homo sapiens (Human)
Description:ChEMBL_1333884
Residue:234
BDBM50132252
NameBDBM50132252
Synonyms:2-Biphenyl-4-yl-N-[4-(5-methyl-2,4-dioxo-3,4-dihydro-2H-pyrimidin-1-yl)-but-2-enyl]-acetamide | CHEMBL102650
TypeSmall organic molecule
Emp. Form.C23H23N3O3
Mol. Mass.389.447
SMILESCc1cn(C\C=C/CNC(=O)Cc2ccc(cc2)-c2ccccc2)c(=O)[nH]c1=O