Reaction Details
TargetDual specificity mitogen-activated protein kinase kinase 1
LigandBDBM50132263
Substrate/Competitorn/a
Meas. Tech.ChEBML_124004
IC50 9±n/a nM
Citation Berger, DDutia, MPowell, DWu, BWissner, ABoschelli, DHFloyd, MBZhang, NTorres, NLevin, JDu, XWojciechowicz, DDiscafani, CKohler, CKim, SCFeldberg, LRCollins, KMallon, R Synthesis and evaluation of 4-anilino-6,7-dialkoxy-3-quinolinecarbonitriles as inhibitors of kinases of the Ras-MAPK signaling cascade. Bioorg Med Chem Lett13:3031-4 (2003) Dual specificity mitogen-activated protein kinase kinase 1
Name:Dual specificity mitogen-activated protein kinase kinase 1
Type:Other Protein Type
Mol. Mass.:43439.03
Organism:Homo sapiens (Human)
Description:Full-length human MEK-1 was generated by PCR and purified as a fusion protein from Escherichia coli lysates.
Residue:393
BDBM50132263
NameBDBM50132263
Synonyms:4-[3-Chloro-4-(thiazol-2-ylsulfanyl)-phenylamino]-6-methoxy-7-(3-morpholin-4-yl-propoxy)-quinoline-3-carbonitrile | CHEMBL102786
TypeSmall organic molecule
Emp. Form.C27H26ClN5O3S2
Mol. Mass.568.11
SMILESCOc1cc2c(Nc3ccc(Sc4nccs4)c(Cl)c3)c(cnc2cc1OCCCN1CCOCC1)C#N