Reaction Details
TargetProtein kinase C alpha type
LigandBDBM50132319
Substrate/Competitorn/a
Meas. Tech.ChEBML_160276
IC50 170±n/a nM
Citation Zhang, HCWhite, KBYe, HMcComsey, DFDerian, CKAddo, MFAndrade-Gordon, PEckardt, AJConway, BRWestover, LXu, JZLook, RDemarest, KTEmanuel, SMaryanoff, BE Macrocyclic bisindolylmaleimides as inhibitors of protein kinase C and glycogen synthase kinase-3. Bioorg Med Chem Lett13:3049-53 (2003) Protein kinase C alpha type
Name:Protein kinase C alpha type
Type:Enzyme
Mol. Mass.:76755.65
Organism:Homo sapiens (Human)
Description:The recombinant human PKC enzymes were produced using a baculovirus expression system in SF9 cells
Residue:672
BDBM50132319
NameBDBM50132319
Synonyms:20-isopropyl-17,23-dioxa-4,14,20,26-tetraazahexacyclo[24.6.1.17,14.02,6.08,13.027,32]tetratriaconta-1(33),2(6),7(34),8(13),9,11,27(32),28,30-nonaene-3,5-dione | CHEMBL421217
TypeSmall organic molecule
Emp. Form.C31H34N4O4
Mol. Mass.526.6261
SMILESCC(C)N1CCOCCn2cc(C3=C(C(=O)NC3=O)c3cn(CCOCC1)c1ccccc31)c1ccccc21