Reaction Details
TargetProtein kinase C alpha type
LigandBDBM50132314
Substrate/Competitorn/a
Meas. Tech.ChEBML_160276
IC50 910±n/a nM
Citation Zhang, HCWhite, KBYe, HMcComsey, DFDerian, CKAddo, MFAndrade-Gordon, PEckardt, AJConway, BRWestover, LXu, JZLook, RDemarest, KTEmanuel, SMaryanoff, BE Macrocyclic bisindolylmaleimides as inhibitors of protein kinase C and glycogen synthase kinase-3. Bioorg Med Chem Lett13:3049-53 (2003) Protein kinase C alpha type
Name:Protein kinase C alpha type
Type:Enzyme
Mol. Mass.:76755.65
Organism:Homo sapiens (Human)
Description:The recombinant human PKC enzymes were produced using a baculovirus expression system in SF9 cells
Residue:672
BDBM50132314
NameBDBM50132314
Synonyms:20,26-diethyl-17,23-dioxa-4,14,20,26,29-pentaazahexacyclo[27.6.1.17,14.02,6.08,13.030,35]heptatriaconta-1(36),2(6),7(37),8(13),9,11,30(35),31,33-nonaene-3,5-dione | CHEMBL103421
TypeSmall organic molecule
Emp. Form.C34H41N5O4
Mol. Mass.583.7204
SMILESCCN1CCOCCN(CC)CCn2cc(C3=C(C(=O)NC3=O)c3cn(CCOCC1)c1ccccc31)c1ccccc21