Reaction Details
TargetProtein kinase C epsilon type
LigandBDBM50132317
Substrate/Competitorn/a
Meas. Tech.ChEBML_160969
IC50 610±n/a nM
Citation Zhang, HCWhite, KBYe, HMcComsey, DFDerian, CKAddo, MFAndrade-Gordon, PEckardt, AJConway, BRWestover, LXu, JZLook, RDemarest, KTEmanuel, SMaryanoff, BE Macrocyclic bisindolylmaleimides as inhibitors of protein kinase C and glycogen synthase kinase-3. Bioorg Med Chem Lett13:3049-53 (2003) Protein kinase C epsilon type
Name:Protein kinase C epsilon type
Type:Enzyme
Mol. Mass.:83680.45
Organism:Homo sapiens (Human)
Description:The recombinant human PKC enzymes were produced using a baculovirus expression system in SF9 cells
Residue:737
BDBM50132317
NameBDBM50132317
Synonyms:17,23-dimethyl-20-oxa-4,14,17,23,26-pentaazahexacyclo[24.6.1.17,14.02,6.08,13.027,32]tetratriaconta-1(33),2(6),7(34),8(13),9,11,27(32),28,30-nonaene-3,5-dione | CHEMBL105477
TypeSmall organic molecule
Emp. Form.C30H33N5O3
Mol. Mass.511.6147
SMILESCN1CCOCCN(C)CCn2cc(C3=C(C(=O)NC3=O)c3cn(CC1)c1ccccc31)c1ccccc21