Reaction Details
TargetProtein kinase C delta type
LigandBDBM50132315
Substrate/Competitorn/a
Meas. Tech.ChEBML_160783
IC50 1160±n/a nM
Citation Zhang, HCWhite, KBYe, HMcComsey, DFDerian, CKAddo, MFAndrade-Gordon, PEckardt, AJConway, BRWestover, LXu, JZLook, RDemarest, KTEmanuel, SMaryanoff, BE Macrocyclic bisindolylmaleimides as inhibitors of protein kinase C and glycogen synthase kinase-3. Bioorg Med Chem Lett13:3049-53 (2003) Protein kinase C delta type
Name:Protein kinase C delta type
Type:Enzyme
Mol. Mass.:77516.79
Organism:Homo sapiens (Human)
Description:The recombinant human PKC enzymes were produced using a baculovirus expression system in SF9 cells
Residue:676
BDBM50132315
NameBDBM50132315
Synonyms:17,20,23-trimethyl-4,14,17,20,23,26-hexaazahexacyclo[24.6.1.17,14.02,6.08,13.027,32]tetratriaconta-1(33),2(6),7(34),8(13),9,11,27(32),28,30-nonaene-3,5-dione | CHEMBL103628
TypeSmall organic molecule
Emp. Form.C31H36N6O2
Mol. Mass.524.6565
SMILESCN1CCN(C)CCn2cc(C3=C(C(=O)NC3=O)c3cn(CCN(C)CC1)c1ccccc31)c1ccccc21