Reaction Details
TargetPlatelet-derived growth factor receptor alpha/beta
LigandBDBM50132385
Substrate/Competitorn/a
Meas. Tech.ChEMBL_158494 (CHEMBL764773)
IC50 96±n/a nM
Citation Myers, MRHe, WHanney, BSetzer, NMaguire, MPZulli, ABilder, GGalzcinski, HAmin, DNeedle, SSpada, AP Potent quinoxaline-based inhibitors of PDGF receptor tyrosine kinase activity. Part 1: SAR exploration and effective bioisosteric replacement of a phenyl substituent. Bioorg Med Chem Lett13:3091-5 (2003) Platelet-derived growth factor receptor alpha/beta
Name:Platelet-derived growth factor receptor alpha/beta
Type:n/a
Mol. Mass.:n/a
Description:ASSAY_ID of EBI is 29498
Components:This complex has 2 components.
Component 1
Name:Platelet-derived growth factor receptor beta
Synonyms:Beta-type platelet-derived growth factor receptor CD140b antigen PDGF Receptor Substrate PDGFR PDGFR-1 PDGFRB PGFRB_HUMAN Platelet-derived growth factor receptor 1 Platelet-derived growth factor receptor beta (PDGFR-beta) Platelet-derived growth factor receptor beta (PDGFRbeta) | VHL/PDGFRB
Type:Enzyme
Mol. Mass.:123922.25
Organism:Homo sapiens (Human)
Description:P09619
Residue:1106
Component 2
Name:Platelet-derived growth factor receptor alpha
Synonyms:Alpha-type platelet-derived growth factor receptor PDGFRA PGFRA_HUMAN Platelet-derived growth factor receptor alpha (PDGFRA) RHEPDGFRA
Type:Protein
Mol. Mass.:122633.38
Organism:Homo sapiens (Human)
Description:P16234
Residue:1089
BDBM50132385
NameBDBM50132385
Synonyms:CHEMBL104473 | Cyclohexyl-(6,7-dimethoxy-quinolin-3-yl)-amine
TypeSmall organic molecule
Emp. Form.C17H22N2O2
Mol. Mass.286.3688
SMILESCOc1cc2cc(NC3CCCCC3)cnc2cc1OC