Reaction Details
TargetPlatelet-derived growth factor receptor alpha/beta
LigandBDBM50132393
Substrate/Competitorn/a
Meas. Tech.ChEMBL_158491 (CHEMBL764770)
IC50 5100±n/a nM
Citation Myers, MRHe, WHanney, BSetzer, NMaguire, MPZulli, ABilder, GGalzcinski, HAmin, DNeedle, SSpada, AP Potent quinoxaline-based inhibitors of PDGF receptor tyrosine kinase activity. Part 1: SAR exploration and effective bioisosteric replacement of a phenyl substituent. Bioorg Med Chem Lett13:3091-5 (2003) Platelet-derived growth factor receptor alpha/beta
Name:Platelet-derived growth factor receptor alpha/beta
Type:n/a
Mol. Mass.:n/a
Description:ASSAY_ID of EBI is 29498
Components:This complex has 2 components.
Component 1
Name:Platelet-derived growth factor receptor beta
Synonyms:Beta-type platelet-derived growth factor receptor CD140b antigen PDGF Receptor Substrate PDGFR PDGFR-1 PDGFRB PGFRB_HUMAN Platelet-derived growth factor receptor 1 Platelet-derived growth factor receptor beta (PDGFR-beta) Platelet-derived growth factor receptor beta (PDGFRbeta) | VHL/PDGFRB
Type:Enzyme
Mol. Mass.:123922.25
Organism:Homo sapiens (Human)
Description:P09619
Residue:1106
Component 2
Name:Platelet-derived growth factor receptor alpha
Synonyms:Alpha-type platelet-derived growth factor receptor PDGFRA PGFRA_HUMAN Platelet-derived growth factor receptor alpha (PDGFRA) RHEPDGFRA
Type:Protein
Mol. Mass.:122633.38
Organism:Homo sapiens (Human)
Description:P16234
Residue:1089
BDBM50132393
NameBDBM50132393
Synonyms:CHEMBL322428 | Phenyl-quinoxalin-2-yl-amine
TypeSmall organic molecule
Emp. Form.C14H11N3
Mol. Mass.221.2572
SMILESN(c1ccccc1)c1cnc2ccccc2n1