Reaction Details
TargetPlatelet-derived growth factor receptor alpha/beta
LigandBDBM50132397
Substrate/Competitorn/a
Meas. Tech.ChEMBL_158495 (CHEMBL765708)
IC50 879±n/a nM
Citation Myers, MRHe, WHanney, BSetzer, NMaguire, MPZulli, ABilder, GGalzcinski, HAmin, DNeedle, SSpada, AP Potent quinoxaline-based inhibitors of PDGF receptor tyrosine kinase activity. Part 1: SAR exploration and effective bioisosteric replacement of a phenyl substituent. Bioorg Med Chem Lett13:3091-5 (2003) Platelet-derived growth factor receptor alpha/beta
Name:Platelet-derived growth factor receptor alpha/beta
Type:n/a
Mol. Mass.:n/a
Description:ASSAY_ID of EBI is 29498
Components:This complex has 2 components.
Component 1
Name:Platelet-derived growth factor receptor beta
Synonyms:Beta-type platelet-derived growth factor receptor CD140b antigen PDGF Receptor Substrate PDGFR PDGFR-1 PDGFRB PGFRB_HUMAN Platelet-derived growth factor receptor 1 Platelet-derived growth factor receptor beta (PDGFR-beta) Platelet-derived growth factor receptor beta (PDGFRbeta) | VHL/PDGFRB
Type:Enzyme
Mol. Mass.:123922.25
Organism:Homo sapiens (Human)
Description:P09619
Residue:1106
Component 2
Name:Platelet-derived growth factor receptor alpha
Synonyms:Alpha-type platelet-derived growth factor receptor PDGFRA PGFRA_HUMAN Platelet-derived growth factor receptor alpha (PDGFRA) RHEPDGFRA
Type:Protein
Mol. Mass.:122633.38
Organism:Homo sapiens (Human)
Description:P16234
Residue:1089
BDBM50132397
NameBDBM50132397
Synonyms:(+)(R)-Bicyclo[2.2.1]hept-2-yl-(6,7-dimethoxy-quinoxalin-2-yl)-amine | CHEMBL104011
TypeSmall organic molecule
Emp. Form.C17H21N3O2
Mol. Mass.299.3675
SMILESCOc1cc2ncc(N[C@@H]3CC4CCC3C4)nc2cc1OC