Reaction Details
TargetTyrosine-protein kinase JAK2
LigandBDBM50132391
Substrate/Competitorn/a
Meas. Tech.ChEBML_91949
IC50>50000±n/a nM
Citation He, WMyers, MRHanney, BSpada, APBilder, GGalzcinski, HAmin, DNeedle, SPage, KJayyosi, ZPerrone, MH Potent quinoxaline-based inhibitors of PDGF receptor tyrosine kinase activity. Part 2: the synthesis and biological activities of RPR127963 an orally bioavailable inhibitor. Bioorg Med Chem Lett13:3097-100 (2003) Tyrosine-protein kinase JAK2
Name:Tyrosine-protein kinase JAK2
Type:Protein
Mol. Mass.:130684.68
Organism:Homo sapiens (Human)
Description:O60674
Residue:1132
BDBM50132391
NameBDBM50132391
Synonyms:4-((R)-6,7-Dimethoxy-quinoxalin-2-ylamino)-cyclohexanol CHEMBL104466 | RP-127963
TypeSmall organic molecule
Emp. Form.C16H21N3O3
Mol. Mass.303.3562
SMILESCOc1cc2ncc(N[C@H]3CC[C@H](O)CC3)nc2cc1OC