Reaction Details
TargetTyrosine-protein kinase JAK3
LigandBDBM50132417
Substrate/Competitorn/a
Meas. Tech.ChEBML_91950
IC50 200±n/a nM
Citation Adams, CAldous, DJAmendola, SBamborough, PBright, CCrowe, SEastwood, PFenton, GFoster, MHarrison, TKKing, SLai, JLawrence, CLetallec, JPMcCarthy, CMoorcroft, NPage, KRao, SRedford, JSadiq, SSmith, KSouness, JEThurairatnam, SVine, MWyman, B Mapping the kinase domain of Janus Kinase 3. Bioorg Med Chem Lett13:3105-10 (2003) Tyrosine-protein kinase JAK3
Name:Tyrosine-protein kinase JAK3
Type:Protein
Mol. Mass.:125111.08
Organism:Homo sapiens (Human)
Description:P52333
Residue:1124
BDBM50132417
NameBDBM50132417
Synonyms:3-[1-(4-Dimethylamino-phenyl)-meth-(Z)-ylidene]-5-(thiophene-2-carbonyl)-1,3-dihydro-indol-2-one | CHEMBL105255
TypeSmall organic molecule
Emp. Form.C22H18N2O2S
Mol. Mass.374.456
SMILESCN(C)c1ccc(\C=C2/C(=O)Nc3ccc(cc23)C(=O)c2cccs2)cc1