Reaction Details
TargetTyrosine-protein kinase JAK3
LigandBDBM50132431
Substrate/Competitorn/a
Meas. Tech.ChEBML_91950
IC50 2300±n/a nM
Citation Adams, CAldous, DJAmendola, SBamborough, PBright, CCrowe, SEastwood, PFenton, GFoster, MHarrison, TKKing, SLai, JLawrence, CLetallec, JPMcCarthy, CMoorcroft, NPage, KRao, SRedford, JSadiq, SSmith, KSouness, JEThurairatnam, SVine, MWyman, B Mapping the kinase domain of Janus Kinase 3. Bioorg Med Chem Lett13:3105-10 (2003) Tyrosine-protein kinase JAK3
Name:Tyrosine-protein kinase JAK3
Type:Protein
Mol. Mass.:125111.08
Organism:Homo sapiens (Human)
Description:P52333
Residue:1124
BDBM50132431
NameBDBM50132431
Synonyms:3-[1-Phenyl-meth-(Z)-ylidene]-5-(thiophene-2-carbonyl)-1,3-dihydro-indol-2-one | CHEMBL321855
TypeSmall organic molecule
Emp. Form.C20H13NO2S
Mol. Mass.331.388
SMILESO=C(c1cccs1)c1ccc2NC(=O)\C(=C/c3ccccc3)c2c1