Reaction Details
TargetTyrosine-protein phosphatase non-receptor type 22
LigandBDBM50132461
Substrate/Competitorn/a
Meas. Tech.ChEBML_207577
Ki 24780±n/a nM
Citation Pei, ZLi, XLiu, GAbad-Zapatero, CLubben, TZhang, TBallaron, SJHutchins, CWTrevillyan, JMJirousek, MR Discovery and SAR of novel, potent and selective protein tyrosine phosphatase 1B inhibitors. Bioorg Med Chem Lett13:3129-32 (2003) Tyrosine-protein phosphatase non-receptor type 22
Name:Tyrosine-protein phosphatase non-receptor type 22
Type:n/a
Mol. Mass.:91712.31
Organism:Homo sapiens (Human)
Description:Q9Y2R2
Residue:807
BDBM50132461
NameBDBM50132461
Synonyms:2-(4-{2-tert-Butoxycarbonylamino-2-[4-(3-hydroxy-2-methoxycarbonyl-phenoxy)-butylcarbamoyl]-ethyl}-phenoxy)-malonic acid | CHEMBL104371
TypeSmall organic molecule
Emp. Form.C29H36N2O12
Mol. Mass.604.6023
SMILESCOC(=O)c1c(O)cccc1OCCCCNC(=O)C(Cc1ccc(OC(C(O)=O)C(O)=O)cc1)NC(=O)OC(C)(C)C