Reaction Details
TargetTyrosine-protein phosphatase non-receptor type 22
LigandBDBM50132469
Substrate/Competitorn/a
Meas. Tech.ChEBML_207577
Ki 129100±n/a nM
Citation Pei, ZLi, XLiu, GAbad-Zapatero, CLubben, TZhang, TBallaron, SJHutchins, CWTrevillyan, JMJirousek, MR Discovery and SAR of novel, potent and selective protein tyrosine phosphatase 1B inhibitors. Bioorg Med Chem Lett13:3129-32 (2003) Tyrosine-protein phosphatase non-receptor type 22
Name:Tyrosine-protein phosphatase non-receptor type 22
Type:n/a
Mol. Mass.:91712.31
Organism:Homo sapiens (Human)
Description:Q9Y2R2
Residue:807
BDBM50132469
NameBDBM50132469
Synonyms:2-(2-carboxy-4-{2-[4-(3-hydroxy-2-methyloxycarbonylphenoxy)butylcarbamoyl]-2-methylcarboxamidoethyl}phenoxy)acetic acid | CHEMBL320065
TypeSmall organic molecule
Emp. Form.C26H30N2O11
Mol. Mass.546.5232
SMILESCOC(=O)c1c(O)cccc1OCCCCNC(=O)[C@H](Cc1ccc(OCC(O)=O)c(c1)C(O)=O)NC(C)=O