Reaction Details
TargetTyrosine-protein phosphatase non-receptor type 22
LigandBDBM50132465
Substrate/Competitorn/a
Meas. Tech.ChEBML_207577
Ki 1970±n/a nM
Citation Pei, ZLi, XLiu, GAbad-Zapatero, CLubben, TZhang, TBallaron, SJHutchins, CWTrevillyan, JMJirousek, MR Discovery and SAR of novel, potent and selective protein tyrosine phosphatase 1B inhibitors. Bioorg Med Chem Lett13:3129-32 (2003) Tyrosine-protein phosphatase non-receptor type 22
Name:Tyrosine-protein phosphatase non-receptor type 22
Type:n/a
Mol. Mass.:91712.31
Organism:Homo sapiens (Human)
Description:Q9Y2R2
Residue:807
BDBM50132465
NameBDBM50132465
Synonyms:5-{(S)-2-((S)-2-tert-Butoxycarbonylamino-3-phenyl-propionylamino)-2-[4-(2-methoxycarbonyl-3-hydroxy-phenoxy)-butylcarbamoyl]-ethyl}-2-(1-carboxy-ethoxy)-benzoic acid | CHEMBL107729
TypeSmall organic molecule
Emp. Form.C39H47N3O13
Mol. Mass.765.8028
SMILESCOC(=O)c1c(O)cccc1OCCCCNC(=O)[C@H](Cc1ccc(OC(C)C(O)=O)c(c1)C(O)=O)NC(=O)[C@H](Cc1ccccc1)NC(=O)OC(C)(C)C