Reaction Details
TargetTyrosine-protein phosphatase non-receptor type 22
LigandBDBM50132463
Substrate/Competitorn/a
Meas. Tech.ChEBML_207577
Ki 97800±n/a nM
Citation Pei, ZLi, XLiu, GAbad-Zapatero, CLubben, TZhang, TBallaron, SJHutchins, CWTrevillyan, JMJirousek, MR Discovery and SAR of novel, potent and selective protein tyrosine phosphatase 1B inhibitors. Bioorg Med Chem Lett13:3129-32 (2003) Tyrosine-protein phosphatase non-receptor type 22
Name:Tyrosine-protein phosphatase non-receptor type 22
Type:n/a
Mol. Mass.:91712.31
Organism:Homo sapiens (Human)
Description:Q9Y2R2
Residue:807
BDBM50132463
NameBDBM50132463
Synonyms:2-[4-((S)-2-tert-Butoxycarbonylamino-3-{4-[(2-carboxy-2-phenyl-ethyl)-oxalyl-amino]-phenyl}-propionylamino)-butoxy]-6-hydroxy-benzoic acid methyl ester | CHEMBL322726
TypeSmall organic molecule
Emp. Form.C37H43N3O12
Mol. Mass.721.7502
SMILESCOC(=O)c1c(O)cccc1OCCCCNC(=O)[C@H](Cc1ccc(cc1)N(CC(C(O)=O)c1ccccc1)C(=O)C(O)=O)NC(=O)OC(C)(C)C