Reaction Details
TargetPeroxisome proliferator-activated receptor alpha
LigandBDBM50132472
Substrate/Competitorn/a
Meas. Tech.ChEMBL_153378 (CHEMBL763565)
EC50 0.615000±n/a nM
Citation Miyachi, HUchiki, H Analysis of the critical structural determinant(s) of species-selective peroxisome proliferator-activated receptor alpha (PPAR alpha)-activation by phenylpropanoic acid-type PPAR alpha agonists. Bioorg Med Chem Lett13:3145-9 (2003) Peroxisome proliferator-activated receptor alpha
Name:Peroxisome proliferator-activated receptor alpha
Type:Enzyme
Mol. Mass.:52222.08
Organism:Homo sapiens (Human)
Description:Q07869
Residue:468
BDBM50132472
NameBDBM50132472
Synonyms:(S)-2-{3-[4-(4-Fluoro-phenoxy)-benzylcarbamoyl]-4-methoxy-benzyl}-butyric acid | CHEMBL318351
TypeSmall organic molecule
Emp. Form.C26H26FNO5
Mol. Mass.451.4867
SMILESCC[C@@H](Cc1ccc(OC)c(c1)C(=O)NCc1ccc(Oc2ccc(F)cc2)cc1)C(O)=O