Reaction Details
TargetRetinoic acid receptor RXR-alpha
LigandBDBM50132584
Substrate/Competitorn/a
Meas. Tech.ChEMBL_196770 (CHEMBL798931)
Ki 11±n/a nM
Citation Gernert, DLAjamie, RArdecky, RABell, MGLeibowitz, MDMais, DAMapes, CMMichellys, PYRungta, DReifel-Miller, ATyhonas, JSYumibe, NGrese, TA Design and synthesis of fluorinated RXR modulators. Bioorg Med Chem Lett13:3191-5 (2003) Retinoic acid receptor RXR-alpha
Name:Retinoic acid receptor RXR-alpha
Type:PROTEIN
Mol. Mass.:50820.38
Organism:Homo sapiens (Human)
Description:ChEMBL_1456363
Residue:462
BDBM50132584
NameBDBM50132584
Synonyms:(2Z,4E,6Z)-7-[3,5-Di-tert-butyl-2-(2,2-difluoro-ethoxy)-phenyl]-2-fluoro-3-methyl-octa-2,4,6-trienoic acid | CHEMBL325592
TypeSmall organic molecule
Emp. Form.C25H33F3O3
Mol. Mass.438.5229
SMILESC\C(\C=C\C=C(\C)c1cc(cc(c1OCC(F)F)C(C)(C)C)C(C)(C)C)=C(\F)C(O)=O