Reaction Details
TargetRetinoic acid receptor gamma
LigandBDBM50132582
Substrate/Competitorn/a
Meas. Tech.ChEBML_196011
Ki>10000±n/a nM
Citation Gernert, DLAjamie, RArdecky, RABell, MGLeibowitz, MDMais, DAMapes, CMMichellys, PYRungta, DReifel-Miller, ATyhonas, JSYumibe, NGrese, TA Design and synthesis of fluorinated RXR modulators. Bioorg Med Chem Lett13:3191-5 (2003) Retinoic acid receptor gamma
Name:Retinoic acid receptor gamma
Type:PROTEIN
Mol. Mass.:50345.43
Organism:Homo sapiens (Human)
Description:ChEMBL_1458016
Residue:454
BDBM50132582
NameBDBM50132582
Synonyms:(2Z,4E,6Z)-7-(2-Butoxy-3,5-di-tert-butyl-phenyl)-3-trifluoromethyl-octa-2,4,6-trienoic acid | CHEMBL107554
TypeSmall organic molecule
Emp. Form.C27H37F3O3
Mol. Mass.466.5761
SMILESCCCCOc1c(cc(cc1C(C)(C)C)C(C)(C)C)C(\C)=C/C=C/C(=C/C(O)=O)/C(F)(F)F