Reaction Details
TargetRetinoic acid receptor gamma
LigandBDBM50132585
Substrate/Competitorn/a
Meas. Tech.ChEBML_196011
Ki>10000±n/a nM
Citation Gernert, DLAjamie, RArdecky, RABell, MGLeibowitz, MDMais, DAMapes, CMMichellys, PYRungta, DReifel-Miller, ATyhonas, JSYumibe, NGrese, TA Design and synthesis of fluorinated RXR modulators. Bioorg Med Chem Lett13:3191-5 (2003) Retinoic acid receptor gamma
Name:Retinoic acid receptor gamma
Type:PROTEIN
Mol. Mass.:50345.43
Organism:Homo sapiens (Human)
Description:ChEMBL_1458016
Residue:454
BDBM50132585
NameBDBM50132585
Synonyms:(2E,4Z,6Z)-7-[3,5-Di-tert-butyl-2-(2,2-difluoro-ethoxy)-phenyl]-4-fluoro-3-methyl-octa-2,4,6-trienoic acid | CHEMBL326673
TypeSmall organic molecule
Emp. Form.C25H33F3O3
Mol. Mass.438.5229
SMILESC\C(=C/C(O)=O)\C(\F)=C\C=C(\C)c1cc(cc(c1OCC(F)F)C(C)(C)C)C(C)(C)C